{"text_format":"1","workbook":"xlsx","n_sheets":8,"sheets":["Product Selector Tool","Form","Output","INPUTS","Data","Filters","OSHA Rules","SC Cost Calculator"],"not_rendered":{"charts":0,"images":2,"macros":1,"external_links":2,"defined_names":72,"comments":0,"pivot_tables":0},"unopened":[],"bounds":{"document_bytes":16777216,"sheet_cells":100000,"rows_first":2000,"rows_last":500,"rows_between":2000,"halvings":0,"cell_chars":16384,"cell_head_chars":4096},"cells_cut":0,"cells_raw":0,"read":"whole","date_system":"1900"}

{"sheet":"Product Selector Tool","index":0,"n_rows":75,"n_cols":26,"rows_kept":75,"cut":false,"hidden":true,"merged":[]}
["Product Selector - Updated February 2020"]
[]
[null,"Introductory Questions"]
[null,"1) ","What Type Work Environment(s) do you have?   (Check all that Apply)  Drop Down Menu and only those checked are displayed"]
[null,"2) ","We are suggesting you take advantage of  the benefits of SmartCompliance:  Cost Savings, Convenient Re-ordering, Staying Compliant. We will demonstrate the cost savings a the end of the selection."]
[null,"2a) ","Does your company dispense medications to your employees?"]
[null,"3) ","How many buildings do you have?  "]
[null,"3a) ","What is the average number of floors per building?"]
[null,"3b) ","How many cabinets would be needed on an average floor in those building(s) that employees can reach a cabinet within 1 minute?"]
[null,"4)  ","It looks like you need X first Aid Cabinets.  How many of those X cabinets have Heavy usage?  Medium Usage? Light Usage?  The total should equal X"]
{"$rows_left_out":66}
{"sheet":"Form","index":1,"n_rows":219,"n_cols":11,"rows_kept":219,"cut":false,"hidden":false,"merged":[[42,1,42,2],[50,1,50,2],[157,1,157,3],[157,4,157,6],[158,1,158,3],[158,4,158,6],[152,1,152,3],[152,4,152,6],[153,1,153,3],[153,4,153,6],[154,1,154,3],[154,4,154,6],[155,1,155,3],[155,4,155,6],[156,1,156,3],[156,4,156,6],[147,1,147,3],[147,4,147,6],[148,1,148,3],[148,4,148,6],[149,1,149,3],[149,4,149,6],[150,1,150,3],[150,4,150,6],[151,1,151,3],[151,4,151,6],[142,1,142,3],[142,4,142,6],[143,1,143,3],[143,4,143,6],[144,1,144,3],[144,4,144,6],[145,1,145,3],[145,4,145,6],[146,1,146,3],[146,4,146,6],[137,4,137,6],[138,1,138,3],[138,4,138,6],[139,1,139,3],[139,4,139,6],[140,1,140,3],[140,4,140,6],[141,1,141,3],[141,4,141,6],[126,1,126,3],[126,4,126,6],[127,1,127,3],[127,4,127,6],[128,1,128,3],[128,4,128,6],[129,1,129,3],[129,4,129,6],[130,1,130,3],[130,4,130,6],[121,1,121,3],[121,4,121,6],[122,1,122,3],[122,4,122,6],[123,1,123,3],[123,4,123,6],[124,1,124,3],[124,4,124,6],[125,1,125,3],[125,4,125,6],[116,1,116,3],[116,4,116,6],[117,1,117,3],[117,4,117,6],[118,1,118,3],[118,4,118,6],[119,1,119,3],[119,4,119,6],[120,1,120,3],[120,4,120,6],[87,1,87,3],[87,4,87,6],[88,1,88,3],[88,4,88,6],[89,1,89,3],[89,4,89,6],[90,1,90,3],[90,4,90,6],[91,1,91,3],[91,4,91,6],[82,1,82,3],[82,4,82,6],[83,1,83,3],[83,4,83,6],[84,1,84,3],[84,4,84,6],[85,1,85,3],[85,4,85,6],[86,1,86,3],[86,4,86,6],[77,1,77,3],[77,4,77,6],[78,1,78,3],[78,4,78,6],[79,1,79,3],[79,4,79,6],[80,1,80,3],[80,4,80,6],[81,1,81,3],[81,4,81,6],[67,1,67,3],[67,4,67,6],[68,1,68,3],[68,4,68,6],[69,1,69,3],[69,4,69,6],[70,1,70,3],[70,4,70,6],[71,1,71,3],[71,4,71,6],[65,1,65,3],[65,4,65,6],[66,1,66,3],[66,4,66,6],[22,2,22,3],[17,2,17,3],[42,5,42,6],[43,5,43,6],[46,5,46,6],[47,5,47,6],[59,4,59,6],[59,1,59,3],[60,1,60,3],[60,4,60,6],[61,1,61,3],[61,4,61,6],[62,1,62,3],[62,4,62,6],[63,1,63,3],[63,4,63,6],[64,1,64,3],[64,4,64,6],[52,5,52,6],[28,2,28,3],[217,1,217,3],[211,1,211,3],[213,1,213,3],[177,2,177,3],[176,2,176,3],[178,2,178,3],[179,2,179,3],[216,1,216,3],[191,5,191,7],[192,5,192,7],[193,5,193,7],[194,5,194,7],[195,5,195,7],[196,5,196,7],[190,5,190,7],[72,1,72,3],[72,4,72,6],[73,1,73,3],[73,4,73,6],[74,1,74,3],[74,4,74,6],[75,1,75,3],[75,4,75,6],[76,1,76,3],[76,4,76,6],[92,1,92,3],[92,4,92,6],[93,1,93,3],[93,4,93,6],[94,1,94,3],[94,4,94,6],[95,1,95,3],[95,4,95,6],[96,1,96,3],[96,4,96,6],[97,1,97,3],[97,4,97,6],[98,1,98,3],[98,4,98,6],[99,1,99,3],[104,1,104,3],[104,4,104,6],[105,1,105,3],[105,4,105,6],[99,4,99,6],[100,1,100,3],[100,4,100,6],[101,1,101,3],[101,4,101,6],[102,1,102,3],[102,4,102,6],[103,1,103,3],[103,4,103,6],[114,1,114,3],[114,4,114,6],[115,1,115,3],[115,4,115,6],[106,1,106,3],[106,4,106,6],[107,1,107,3],[107,4,107,6],[108,1,108,3],[108,4,108,6],[109,1,109,3],[109,4,109,6],[110,1,110,3],[110,4,110,6],[218,1,218,8],[136,1,136,3],[136,4,136,6],[137,1,137,3],[189,1,189,8],[44,5,44,6],[45,5,45,6],[48,5,48,6],[131,1,131,3],[131,4,131,6],[132,1,132,3],[132,4,132,6],[133,1,133,3],[133,4,133,6],[134,1,134,3],[134,4,134,6],[135,1,135,3],[135,4,135,6],[111,1,111,3],[111,4,111,6],[112,1,112,3],[112,4,112,6],[113,1,113,3],[113,4,113,6]]}
[]
[null,"Below is the First Aid Assessor developed by First Aid Only.   It will help a business choose the "]
[null,"right first aid products based on the business operations and size.  "]
[]
[null,"To use the tool, simply answer the questions below and then switch to the \"Output\" worksheet and "]
[null,"click the \"Re-calcuate\" button.   You may click on an individual product hyperlink to learn more "]
[null,"about a particular product.   The Output sheet may also be saved as a pdf to be emailed out."]
[]
[]
[null,"1. What Type Work Environment(s) do you have?   (Check all that Apply)"]
{"$rows_left_out":210}
{"sheet":"Output","index":2,"n_rows":15,"n_cols":6,"rows_kept":15,"cut":false,"hidden":false,"merged":[[2,0,2,1],[3,0,3,1],[4,0,4,1]]}
["First Aid Assessor Recommended Product Offering"]
["Please click the \"Re-Calculate\" button to review your recommended products based on your business parameter.             Items may be added or removed, Document may be saved as a pdf. Pricing provided separately."]
["Company Name:"]
["Filled out By (name, contact information):"]
["Date:"]
[]
["Type of First Aid Need","Product Location","Kit #","Description","Qty","Link"]
["Office",0,90829,"XL Metal SC No Meds, 654 pcs.",1,"https://www.firstaidonly.com/xl-smartcompliance-general-business-first-aid-cabinet-metal.html?___store=fao"]
["Office",0,90578,"Medium Metal SC, No Meds, 94 pcs.",1,"https://www.firstaidonly.com/medium-metal-smart-compliance-cabinet-ansi-a-without-medications.html?___store=fao"]
["BBPKit","",3060,"BBP and Protective Apparel in Plastic case - 32 pcs.",1,"N/A"]
{"$rows_left_out":6}
{"sheet":"INPUTS","index":3,"n_rows":5,"n_cols":2,"rows_kept":5,"cut":false,"hidden":true,"merged":[]}
["SmartCompliance Cabinet Size","MSRP"]
["Heavy",426.4]
["Medium",191.78]
["Light",127.82]
["Retrofit - ANSI Class B",149.9]

{"sheet":"Data","index":4,"n_rows":62,"n_cols":18,"rows_kept":62,"cut":false,"hidden":true,"merged":[]}
["SmartCompliance","Medications","Usage","# of EE","Shelf","Type of Business","Label","Kit #","Description","Qty","Link","Unit Cost","Total Cost"]
["Yes","Yes","Heavy",150,null,"Office",{"$f":"IFERROR(INDEX(Form!E$60:E$159,MATCH(tblData[[#This Row],[Type of Business]]&\"-\"&tblData[[#This Row],[Usage]],Form!B$60:B$159,0)),\"\")","v":0},90732,"XL Metal SC with Meds, 909 pcs.",{"$f":"IF(AND(INDIRECT(\"one\"&tblData[[#This Row],[Type of Business]])=\"ü\",eightA=IF(tblData[[#This Row],[Medications]]=\"Yes\",\"ü\",\"\"),thirteenA=IF(tblData[[#This Row],[SmartCompliance]]=\"Yes\",\"ü\",\"\")),INDIRECT(\"six\"&tblData[[#This Row],[Type of Business]]&tblData[[#This Row],[Usage]]),0)","v":0},"https://www.firstaidonly.com/xl-cabinet-xl-smartcompliance-cabinet.html?___store=fao",191.83,{"$f":"tblData[[#This Row],[Qty]]*tblData[[#This Row],[Unit Cost]]","v":0}]
["Yes","Yes","Medium",50,null,"Office",{"$f":"IFERROR(INDEX(Form!E$60:E$159,MATCH(tblData[[#This Row],[Type of Business]]&\"-\"&tblData[[#This Row],[Usage]],Form!B$60:B$159,0)),\"\")","v":""},"1000-FAE-0103","Large Plastic SC with Meds, 245 pcs.",{"$f":"IF(AND(INDIRECT(\"one\"&tblData[[#This Row],[Type of Business]])=\"ü\",eightA=IF(tblData[[#This Row],[Medications]]=\"Yes\",\"ü\",\"\"),thirteenA=IF(tblData[[#This Row],[SmartCompliance]]=\"Yes\",\"ü\",\"\")),INDIRECT(\"six\"&tblData[[#This Row],[Type of Business]]&tblData[[#This Row],[Usage]]),0)","v":0},"https://www.firstaidonly.com/large-smart-compliance-general-workplace-first-aid-plastic-cabinet-with-pain-relief.html?___store=fao",59.25,{"$f":"tblData[[#This Row],[Qty]]*tblData[[#This Row],[Unit Cost]]","v":0}]
["Yes","Yes","Light",25,null,"Office",{"$f":"IFERROR(INDEX(Form!E$60:E$159,MATCH(tblData[[#This Row],[Type of Business]]&\"-\"&tblData[[#This Row],[Usage]],Form!B$60:B$159,0)),\"\")","v":0},90578,"Medium Metal SC, No Meds, 94 pcs.",{"$f":"IF(AND(INDIRECT(\"one\"&tblData[[#This Row],[Type of Business]])=\"ü\",eightA=IF(tblData[[#This Row],[Medications]]=\"Yes\",\"ü\",\"\"),thirteenA=IF(tblData[[#This Row],[SmartCompliance]]=\"Yes\",\"ü\",\"\")),INDIRECT(\"six\"&tblData[[#This Row],[Type of Business]]&tblData[[#This Row],[Usage]]),0)","v":0},"https://www.firstaidonly.com/medium-metal-smart-compliance-cabinet-ansi-a-without-medications.html?___store=fao",57.51,{"$f":"tblData[[#This Row],[Qty]]*tblData[[#This Row],[Unit Cost]]","v":0}]
["Yes","Yes","Medium",50,null,"LightManufacturing",{"$f":"IFERROR(INDEX(Form!E$60:E$159,MATCH(tblData[[#This Row],[Type of Business]]&\"-\"&tblData[[#This Row],[Usage]],Form!B$60:B$159,0)),\"\")","v":""},746000,"Large Metal SC with Meds, 241 pcs.",{"$f":"IF(AND(INDIRECT(\"one\"&tblData[[#This Row],[Type of Business]])=\"ü\",eightA=IF(tblData[[#This Row],[Medications]]=\"Yes\",\"ü\",\"\"),thirteenA=IF(tblData[[#This Row],[SmartCompliance]]=\"Yes\",\"ü\",\"\")),INDIRECT(\"six\"&tblData[[#This Row],[Type of Business]]&tblData[[#This Row],[Usage]]),0)","v":0},"https://www.firstaidonly.com/large-metal-smart-compliance-first-aid-cabinet-ansi-a-compliant-with-medication.html?___store=fao",86.29,{"$f":"tblData[[#This Row],[Qty]]*tblData[[#This Row],[Unit Cost]]","v":0}]
["Yes","Yes","Light",25,null,"LightManufacturing",{"$f":"IFERROR(INDEX(Form!E$60:E$159,MATCH(tblData[[#This Row],[Type of Business]]&\"-\"&tblData[[#This Row],[Usage]],Form!B$60:B$159,0)),\"\")","v":""},90578,"Medium Metal SC, No Meds, 94 pcs.",{"$f":"IF(AND(INDIRECT(\"one\"&tblData[[#This Row],[Type of Business]])=\"ü\",eightA=IF(tblData[[#This Row],[Medications]]=\"Yes\",\"ü\",\"\"),thirteenA=IF(tblData[[#This Row],[SmartCompliance]]=\"Yes\",\"ü\",\"\")),INDIRECT(\"six\"&tblData[[#This Row],[Type of Business]]&tblData[[#This Row],[Usage]]),0)","v":0},"https://www.firstaidonly.com/medium-metal-smart-compliance-cabinet-ansi-a-without-medications.html?___store=fao",57.51,{"$f":"tblData[[#This Row],[Qty]]*tblData[[#This Row],[Unit Cost]]","v":0}]
["Yes","Yes","VeryHeavy",200,null,"HeavyManufacturing",{"$f":"IFERROR(INDEX(Form!E$60:E$159,MATCH(tblData[[#This Row],[Type of Business]]&\"-\"&tblData[[#This Row],[Usage]],Form!B$60:B$159,0)),\"\")","v":""},90832,"XXL Metal SC with Meds, 1643 pcs.",{"$f":"IF(AND(INDIRECT(\"one\"&tblData[[#This Row],[Type of Business]])=\"ü\",eightA=IF(tblData[[#This Row],[Medications]]=\"Yes\",\"ü\",\"\"),thirteenA=IF(tblData[[#This Row],[SmartCompliance]]=\"Yes\",\"ü\",\"\")),INDIRECT(\"six\"&tblData[[#This Row],[Type of Business]]&tblData[[#This Row],[Usage]]),0)","v":0},"https://www.firstaidonly.com/xxl-smartcompliance-general-business-first-aid-cabinet-with-medication.html?___store=fao",191.83,{"$f":"tblData[[#This Row],[Qty]]*tblData[[#This Row],[Unit Cost]]","v":0}]
["Yes","Yes","Heavy",150,null,"HeavyManufacturing",{"$f":"IFERROR(INDEX(Form!E$60:E$159,MATCH(tblData[[#This Row],[Type of Business]]&\"-\"&tblData[[#This Row],[Usage]],Form!B$60:B$159,0)),\"\")","v":0},90732,"XL Metal SC with Meds, 909 pcs.",{"$f":"IF(AND(INDIRECT(\"one\"&tblData[[#This Row],[Type of Business]])=\"ü\",eightA=IF(tblData[[#This Row],[Medications]]=\"Yes\",\"ü\",\"\"),thirteenA=IF(tblData[[#This Row],[SmartCompliance]]=\"Yes\",\"ü\",\"\")),INDIRECT(\"six\"&tblData[[#This Row],[Type of Business]]&tblData[[#This Row],[Usage]]),0)","v":0},"https://www.firstaidonly.com/xl-cabinet-xl-smartcompliance-cabinet.html?___store=fao",191.83,{"$f":"tblData[[#This Row],[Qty]]*tblData[[#This Row],[Unit Cost]]","v":0}]
["Yes","Yes","Heavy",150,null,"Warehouse",{"$f":"IFERROR(INDEX(Form!E$60:E$159,MATCH(tblData[[#This Row],[Type of Business]]&\"-\"&tblData[[#This Row],[Usage]],Form!B$60:B$159,0)),\"\")","v":0},90732,"XL Metal SC with Meds, 909 pcs.",{"$f":"IF(AND(INDIRECT(\"one\"&tblData[[#This Row],[Type of Business]])=\"ü\",eightA=IF(tblData[[#This Row],[Medications]]=\"Yes\",\"ü\",\"\"),thirteenA=IF(tblData[[#This Row],[SmartCompliance]]=\"Yes\",\"ü\",\"\")),INDIRECT(\"six\"&tblData[[#This Row],[Type of Business]]&tblData[[#This Row],[Usage]]),0)","v":0},"https://www.firstaidonly.com/xl-cabinet-xl-smartcompliance-cabinet.html?___store=fao",191.83,{"$f":"tblData[[#This Row],[Qty]]*tblData[[#This Row],[Unit Cost]]","v":0}]
["Yes","Yes","Medium",50,null,"Warehouse",{"$f":"IFERROR(INDEX(Form!E$60:E$159,MATCH(tblData[[#This Row],[Type of Business]]&\"-\"&tblData[[#This Row],[Usage]],Form!B$60:B$159,0)),\"\")","v":""},746000,"Large Metal SC with Meds, 241 pcs.",{"$f":"IF(AND(INDIRECT(\"one\"&tblData[[#This Row],[Type of Business]])=\"ü\",eightA=IF(tblData[[#This Row],[Medications]]=\"Yes\",\"ü\",\"\"),thirteenA=IF(tblData[[#This Row],[SmartCompliance]]=\"Yes\",\"ü\",\"\")),INDIRECT(\"six\"&tblData[[#This Row],[Type of Business]]&tblData[[#This Row],[Usage]]),0)","v":0},"https://www.firstaidonly.com/large-metal-smart-compliance-first-aid-cabinet-ansi-a-compliant-with-medication.html?___store=fao",86.29,{"$f":"tblData[[#This Row],[Qty]]*tblData[[#This Row],[Unit Cost]]","v":0}]
{"$rows_left_out":53}
{"sheet":"Filters","index":5,"n_rows":28,"n_cols":6,"rows_kept":28,"cut":false,"hidden":true,"merged":[]}
["Type of Business","SmartCompliance","Medications","Qty","Usage","Shelf"]
[{"$f":"IF(Form!C11=\"ü\",Form!D11,\"IGNORE\")","v":"Office"},{"$f":"IF(thirteenA=\"ü\",\"Yes\",\"No\")","v":"Yes"},{"$f":"IF(eightA=\"ü\",\"Yes\",\"No\")","v":"No"},">0","Heavy"]
[{"$f":"IF(Form!C11=\"ü\",Form!D11,\"IGNORE\")","v":"Office"},"Yes","No",">0","Medium"]
[{"$f":"IF(Form!C11=\"ü\",Form!D11,\"IGNORE\")","v":"Office"},"Yes","No",">0","Light"]
[{"$f":"IF(Form!C12=\"ü\",SUBSTITUTE(Form!D12,\" \",\"\"),\"IGNORE\")","v":"IGNORE"},"Yes","No",">0","Medium"]
[{"$f":"IF(Form!C12=\"ü\",SUBSTITUTE(Form!D12,\" \",\"\"),\"IGNORE\")","v":"IGNORE"},"Yes","No",">0","Light"]
[{"$f":"IF(Form!C13=\"ü\",SUBSTITUTE(Form!D13,\" \",\"\"),\"IGNORE\")","v":"IGNORE"},"Yes","No",">0","VeryHeavy"]
[{"$f":"IF(Form!C13=\"ü\",SUBSTITUTE(Form!D13,\" \",\"\"),\"IGNORE\")","v":"IGNORE"},"Yes","No",">0","Heavy"]
[{"$f":"IF(Form!F11=\"ü\",Form!G11,\"IGNORE\")","v":"IGNORE"},"Yes","No",">0","Heavy"]
[{"$f":"IF(Form!F11=\"ü\",Form!G11,\"IGNORE\")","v":"IGNORE"},"Yes","No",">0","Medium"]
{"$rows_left_out":19}
{"sheet":"OSHA Rules","index":6,"n_rows":9,"n_cols":2,"rows_kept":9,"cut":false,"hidden":false,"merged":[]}
[]
["OSHA  Rules"]
[]
["First Aid Cabinet - OSHA Regulation","Addendum Text: OSHA says “First aid supplies are required to be readily available under paragraph § 1910.151(b). An example of the minimal contents of a generic first aid kit is described in American National Standard (ANSI) Z308.1.  First aid supplies must be readily available. This is generally considered to mean every floor in every building and separate kits for clean room, food manufacturing and/or food preparation areas. Employees should not have to travel more than 100 feet to secure adequate supplies    "]
["Eyewash - OSHA Regulation","Addendum Text:   Eyewash stations are critical emergency safety equipment intended to mitigate eye injuries when control methods (i.e., eye glasses) do not prevent exposure to a physical or chemical irritant or biological agent.  OSHA Federal Regulations part 1910.151(c) states:  \"Where the eyes  may be exposed to injurious corrosive chemicals, suitable facilities for quick drenching or flushing of the eyes and body shall be provided within the work area for immediate emergency use.  These corrosive chemicals include HIV and HBV research laboratories and production facilities and facilities where the eye may be splashed with solutions containing 0.1 percent or greater formaldehyde\".  Eyewash stations must be installed within 10 seconds walking time from the location of a hazard (approximately 55 feet), installed on the same level as the hazard (i.e. no stairs or ramps), and the path of travel from the hazard to the station should be free of obstructions and as straight as possible.   For more serious potential eye injuries, ANSI Z358.1-2009 specifies that eyewash stations must be capable of delivering tepid flushing fluid to the eyes not less than 1.5 liters per minute (0.4 gallons per minute) for 15 minutes after a single movement and subsequent hands-free operation.   Eyewash bottles are used where the hazard is a long distance from plumbed eyewash stations (i.e., an outside yard) or to help transport an injured worker to a treatment facility.  Eyewash bottles are also ideal when there is a potential hazard to the eye but it is of minimal risk or severity and OSHA or ANSI doesn’t require it. (i.e., Allergens, sawdust or smoke)"]
["Burns (No specific OSHA rules but there are ANSI requirements","The treatment of burns depends on the location and severity of the damage. Sunburns and small scalds can usually be treated at home. Deep or widespread burns need immediate medical attention.   Burns are very painful.  It is very important to apply a burn dressing to the burn area to prevent infection and soothe the victim’s pain.  There are first aid supplies that can both soothe the pain and protect the wound from infection.   For occupations that have the potential for experiencing a severe burn, these first aid kits have dedicated severe burn treatment supplies of items such as Burn Dressings, Burn Cream and Burn Gel:"]
["Bleeding Control Kits (No specific OSHA rules but there are numerous states considering legislation to make Bleeding Control kits mandatory in certain public buildings like schools.","Addendum Text:  Bleeding to death can happen very quickly. If the hemorrhaging isn’t stopped, a person can bleed to death in just five minutes. And if their injuries are severe, this timeline may be even shorter.   That is why it’s important to give co-workers the tools to stop a bleeding event before professional help arrives.  Many occupations or job activities have the potential for a severe bleeding event.   These type of injuries might occur from handling sharp objects, fast moving machinery or saw blades, vehicle accidents and unfortunately gun-related events.  Therefore Bleeding Control kits should be at every worksite.   Some kits have the first aid tools to stop limb wounds with basic and advanced tourniquets while others have hemostatic blood-clotting gauze pads to stop bleeding fast on the torso or limbs"]
["Bloodborne Pathogen Kits - OSHA regulation","Addendum Text:  Bloodborne pathogens can be transmitted through the eyes, skin, nose or mouth, even under the skin if the skin is punctured. An extremely common disease caused by exposure is hepatitis B virus (HBV), hepatitis C virus (HCV), and human immunodeficiency virus (HIV).   Bloodborne pathogens are microorganisms that can be found in the blood or other types of body fluids that can cause serious illness and even diseases. These pathogens can be transmitted through the eyes, skin, nose or mouth, even under the skin if the skin is punctured. An extremely common disease caused by exposure is hepatitis B virus (HBV), hepatitis C virus (HCV), and human immunodeficiency virus (HIV). Many times people carrying bloodborne pathogens may not even be aware that they are infected.\nOSHA adopted a policy in March 1992 (CFR 1910.1030) that was designed to limit exposure to bloodborne pathogens and various types of body fluids at the workplace.  The standard covers any and all employers where there may be a reasonable chance of exposure to bloodborne pathogens.  If through the normal course of an employee’s job function he or she could reasonably be expected to come into contact with potentially infectious bodily fluids (blood, urine, vomit, etc;), compliance with the Bloodborne Pathogens Standard of protection and training is required.  At no cost to the employee, all employers must provide and require employees to use the protective clothing and equipment."]
["Vehicle Kits, OSHA recommendation","Addendum Text:   In order to insure ready availability of first aid supplies to all employees while on the job, company vehicles should include first aid kits. The employee’s company-provided work vehicle is literally their “workplace” and is subject to OSHA regulations just as a facility would be.    OSHA’s General Industry medical and first aid regulation mandates employers to ensure that “adequate first aid supplies [are] readily available” in the workplace. See 29 CFR 1910.151(b).  An important facet of first aid pertains to its location. The first aid kit must be “readily available,” i.e. easy to access in the event of an emergency. This issue is often relatively simple at fixed facilities, but can become more complicated when employees work off-site or drive in company vehicles. In situations like these, employers cannot forget that a first aid kit should be “readily available.” Accordingly, if employers have, for example, delivery truck drivers, it is recommended that these employers equip their trucks with first aid kits.  Most vehicle first aid kits are designated by the number of employees at a remote job site that the vehicle would drive to.  For example a 50-person Vehicle first aid kit is for a vehicle that would typically visit one or more job sites with 50 persons working at those sites.  "]

{"sheet":"SC Cost Calculator","index":7,"n_rows":24,"n_cols":5,"rows_kept":24,"cut":false,"hidden":true,"merged":[]}
[]
[]
[]
[]
[]
[]
[]
[null,"SmartCompliance First Aid Program Cost Calculator"]
[null,null,null,"MSRP","SmartCompliance Cabinet Size"]
[null,1,"How many first aid cabinets do you have in your facility?",468.94,"XL - ANSI Class B+"]
{"$rows_left_out":14}